BDBM225702 CS331
SMILES C[C@H](CCC([O-])=O)[C@H]1CC[C@H]2[C@@H]3CC[C@@H]4C[C@H](O)CC[C@]4(C)[C@H]3C[C@H](O)[C@]12C
InChI Key InChIKey=KXGVEGMKQFWNSR-LLQZFEROSA-M
Data  1 IC50  1 Kd
  Tab Delimited (TSV)   2D SDfile   Computed 3D by Vconf -m prep SDfile
Find this compound or compounds like it in BindingDB:
Activity Spreadsheet -- Enzyme Inhibition Constant Data from BindingDB
Found 1 hit for monomerid = 225702
TargetGlutathione S-transferase omega-1(Homo sapiens (Human))
Monash University
Curated by ChEMBL
LigandPNGBDBM225702(CS331)
Affinity DataIC50:  1.02E+6nM. Assay description: Inhibition of human GSTO1-1 by MMA (V) reductase assay
In DepthDetails ArticlePubMed